Place this near the top of param.cpp:
Code:
#include<stdlib.h>
You are currently viewing the SEQanswers forums as a guest, which limits your access. Click here to register now, and join the discussion
g++ -DMAXGAP=3 -DMAXHITS=10000 -DTHREAD -O3 -DDB_CHR -DREAD_60 -c param.cpp -o param.chr.o g++ -DMAXGAP=3 -DMAXHITS=10000 -DTHREAD -O3 -DDB_CHR -DREAD_60 -c reads.cpp -o reads.chr.o reads.cpp: In member function ‘void ReadClass::CheckFile(std::ifstream&)’: reads.cpp:32: error: ‘exit’ was not declared in this scope reads.cpp:37: error: ‘exit’ was not declared in this scope reads.cpp:41: error: ‘exit’ was not declared in this scope make: *** [reads.chr.o] Error 1
| Topics | Statistics | Last Post | ||
|---|---|---|---|---|
|
Started by SEQadmin2, Yesterday, 05:39 AM
|
0 responses
12 views
0 reactions
|
Last Post
by SEQadmin2
Yesterday, 05:39 AM
|
||
|
Started by SEQadmin2, 10-13-2026, 09:56 AM
|
0 responses
14 views
0 reactions
|
Last Post
by SEQadmin2
10-13-2026, 09:56 AM
|
||
|
Started by SEQadmin2, 10-09-2026, 11:14 AM
|
0 responses
27 views
0 reactions
|
Last Post
by SEQadmin2
10-09-2026, 11:14 AM
|
||
|
Started by SEQadmin2, 09-29-2026, 09:51 AM
|
0 responses
78 views
0 reactions
|
Last Post
by SEQadmin2
09-29-2026, 09:51 AM
|
Comment