View Single Post
Old 07-16-2008, 09:08 AM   #17
ECO
--Site Admin--
 
Location: SF Bay Area, CA, USA

Join Date: Oct 2007
Posts: 1,358
Default

No luck...I'm corresponding with the SOAP team, hopefully they will be able to help me through it. Thanks for the help jjcook

Code:
g++ -DMAXGAP=3 -DMAXHITS=10000 -DTHREAD -O3   -DDB_CHR -DREAD_60  -c param.cpp -o param.chr.o
g++ -DMAXGAP=3 -DMAXHITS=10000 -DTHREAD -O3   -DDB_CHR -DREAD_60  -c reads.cpp -o reads.chr.o
reads.cpp: In member function ‘void ReadClass::CheckFile(std::ifstream&)’:
reads.cpp:32: error: ‘exit’ was not declared in this scope
reads.cpp:37: error: ‘exit’ was not declared in this scope
reads.cpp:41: error: ‘exit’ was not declared in this scope
make: *** [reads.chr.o] Error 1
ECO is offline   Reply With Quote