View Single Post
Old 09-05-2015, 04:54 PM   #1
gwilymh
Member
 
Location: Milwaukee

Join Date: Dec 2011
Posts: 72
Default Trinity 2.0.6 jellyfish compilation error - error: ‚all_of‚ is not a member of ‚std‚

I am trying to install trinity v2.0.6 on a Linux cluster, and am getting a strange error message after running ./configure and then make:
make[1]: Entering directory `/home_directory/src/trinityrnaseq-2.0.6/trinity-plugins/jellyfish-2.1.4'
CXX lib/misc.lo
lib/misc.cc: In function ‚std::string jellyfish::quote_arg(const std::string&)‚:
lib/misc.cc:86: error: ‚all_of‚ is not a member of ‚std‚
make[1]: *** [lib/misc.lo] Error 1
make[1]: Leaving directory `/home_directory/src/trinityrnaseq-2.0.6/trinity-plugins/jellyfish-2.1.4'
make: *** [check] Error 2
Has anyone encountered a similar error?
gwilymh is offline   Reply With Quote