SEQanswers

Go Back   SEQanswers > Bioinformatics > Bioinformatics



Similar Threads
Thread Thread Starter Forum Replies Last Post
Trinity 2.0.6 jellyfish compilation error - error: ‚all_of‚ is not a member of ‚std‚ gwilymh Bioinformatics 0 09-05-2015 03:54 PM
Trinity Error sahusarika Bioinformatics 7 08-06-2015 06:23 AM
Trinity error in both.fa colibri14 Bioinformatics 1 07-19-2015 10:09 AM
Trinity will not install properly on Mac OS X godzilla07 Bioinformatics 4 11-07-2013 01:59 PM
trinity error ECHo Bioinformatics 3 11-30-2011 12:29 PM

Reply
 
Thread Tools
Old 02-08-2016, 11:13 AM   #1
zhanghao
Member
 
Location: BEIJING

Join Date: Nov 2015
Posts: 17
Default Trinity install error

My systerm is ununtu. When I install Trinity wieh make, the error is :

config.status: executing libtool commands
make[1]: entering dictionary `/home/bac/virus_detection/trinityrnaseq_r2012-06-08/trinity-plugins/jellyfish-1.1.5'
make all-am
make[2]: entering dictionary `/home/bac/virus_detection/trinityrnaseq_r2012-06-08/trinity-plugins/jellyfish-1.1.5'
CXX jellyfish/libjellyfish_la-err.lo
In file included from jellyfish/err.cc:17:0:
./jellyfish/err.hpp: In static member function Ďstatic void err::no_t::write(std:stream&, int)í:
./jellyfish/err.hpp:42:46: error: ignoring return value of Ďchar* strerror_r(int, char*, size_t)í, declared with attribute warn_unused_result [-Werror=unused-result]
strerror_r(e, err_str, sizeof(err_str));
^
cc1plus: all warnings being treated as errors
make[2]: *** [jellyfish/libjellyfish_la-err.lo] error 1
make[2]:leaving dictionary `/home/bac/virus_detection/trinityrnaseq_r2012-06-08/trinity-plugins/jellyfish-1.1.5'
make[1]: *** [all] error 2
make[1]:leaving dictionary `/home/bac/virus_detection/trinityrnaseq_r2012-06-08/trinity-plugins/jellyfish-1.1.5'
make: *** [all] error 2
zhanghao is offline   Reply With Quote
Reply

Thread Tools

Posting Rules
You may not post new threads
You may not post replies
You may not post attachments
You may not edit your posts

BB code is On
Smilies are On
[IMG] code is On
HTML code is Off




All times are GMT -8. The time now is 07:34 PM.


Powered by vBulletin® Version 3.8.9
Copyright ©2000 - 2019, vBulletin Solutions, Inc.
Single Sign On provided by vBSSO