SEQanswers

Go Back   SEQanswers > Bioinformatics > Bioinformatics



Similar Threads
Thread Thread Starter Forum Replies Last Post
BWA installation problems seq_GA Bioinformatics 22 04-28-2015 06:15 PM
TopHat installation vinay052003 Bioinformatics 5 11-22-2011 01:54 PM
Tophat installation on Mac G5 chadn737 Bioinformatics 0 09-26-2011 09:47 AM
TopHat installation, beginner Nicolas902 Bioinformatics 5 03-16-2010 04:00 AM
tophat 1.0.12 installation Greg Bioinformatics 1 01-04-2010 10:50 PM

Reply
 
Thread Tools
Old 01-10-2012, 09:14 AM   #1
sebastion
Junior Member
 
Location: Ireland

Join Date: Nov 2011
Posts: 6
Question Tophat Installation problems

Anyone have an idea where Im going wrong?

Im trying to install Tophat via cygwin and hit upon the errors below at the "make" step.

if g++ -DHAVE_CONFIG_H -I. -I. -I.. -I/usr/include -Wall -Wno-strict-alia
-D_FILE_OFFSET_BITS=64 -O3 -DNDEBUG -I/home/ngs/applications//incl
-I./SeqAn-1.2 -Wall -Wno-strict-aliasing -D_FILE_OFFSET_BITS=64 -O3 -DNDEBU
/home/ngs/applications//include -MT reads.o -MD -MP -MF ".deps/reads
" -c -o reads.o reads.cpp; \
then mv -f ".deps/reads.Tpo" ".deps/reads.Po"; else rm -f ".deps/reads.Tpo";
t 1; fi
In file included from ./SeqAn-1.2/seqan/file.h:60:0,
from ./SeqAn-1.2/seqan/score.h:26,
from ./SeqAn-1.2/seqan/find.h:33,
from reads.cpp:21:
./SeqAn-1.2/seqan/system.h:42:18: fatal error: aio.h: No such file or direct
compilation terminated.
Makefile:1062: recipe for target `reads.o' failed
make[2]: *** [reads.o] Error 1
make[2]: Leaving directory `/home/ngs/applications/tophat-1.4.0/src'
Makefile:247: recipe for target `all-recursive' failed
make[1]: *** [all-recursive] Error 1
make[1]: Leaving directory `/home/ngs/applications/tophat-1.4.0'
Makefile:185: recipe for target `all' failed
make: *** [all] Error 2

Id appreciate any help!
thanks

Seb
sebastion is offline   Reply With Quote
Reply

Thread Tools

Posting Rules
You may not post new threads
You may not post replies
You may not post attachments
You may not edit your posts

BB code is On
Smilies are On
[IMG] code is On
HTML code is Off




All times are GMT -8. The time now is 01:16 AM.


Powered by vBulletin® Version 3.8.9
Copyright ©2000 - 2022, vBulletin Solutions, Inc.
Single Sign On provided by vBSSO