SEQanswers

Go Back   SEQanswers > Bioinformatics > Bioinformatics



Similar Threads
Thread Thread Starter Forum Replies Last Post
Velvet Compilation error Biomicrogen Bioinformatics 3 12-09-2014 02:07 PM
Trinity make jellyfish error letusgo Bioinformatics 1 08-05-2013 12:27 PM
BLAT with pslCDnaFilter (compilation error) joomanji Bioinformatics 3 07-05-2013 07:51 PM
Velvet compilation error freshtuo Bioinformatics 1 06-21-2012 06:48 AM
BWA compilation error mabry Bioinformatics 2 05-12-2009 05:16 AM

Reply
 
Thread Tools
Old 09-05-2015, 04:54 PM   #1
gwilymh
Member
 
Location: Milwaukee

Join Date: Dec 2011
Posts: 72
Default Trinity 2.0.6 jellyfish compilation error - error: ‚all_of‚ is not a member of ‚std‚

I am trying to install trinity v2.0.6 on a Linux cluster, and am getting a strange error message after running ./configure and then make:
make[1]: Entering directory `/home_directory/src/trinityrnaseq-2.0.6/trinity-plugins/jellyfish-2.1.4'
CXX lib/misc.lo
lib/misc.cc: In function ‚std::string jellyfish::quote_arg(const std::string&)‚:
lib/misc.cc:86: error: ‚all_of‚ is not a member of ‚std‚
make[1]: *** [lib/misc.lo] Error 1
make[1]: Leaving directory `/home_directory/src/trinityrnaseq-2.0.6/trinity-plugins/jellyfish-2.1.4'
make: *** [check] Error 2
Has anyone encountered a similar error?
gwilymh is offline   Reply With Quote
Reply

Tags
‚std‚, compilation, jellyfish, trinity, trinity 2.0.6

Thread Tools

Posting Rules
You may not post new threads
You may not post replies
You may not post attachments
You may not edit your posts

BB code is On
Smilies are On
[IMG] code is On
HTML code is Off




All times are GMT -8. The time now is 11:27 PM.


Powered by vBulletin® Version 3.8.9
Copyright ©2000 - 2021, vBulletin Solutions, Inc.
Single Sign On provided by vBSSO